Skip to content

Integration Test Runner For PRs #1146

Integration Test Runner For PRs

Integration Test Runner For PRs #1146

Manually triggered February 27, 2025 13:15
Status Failure
Total duration 1h 54m 51s
Artifacts 5

integration-test-runner-JDK11.yml

on: workflow_dispatch
Fit to window
Zoom out
Zoom in

Annotations

2 errors and 3 warnings
build
PR BUILD not successfull. Check artifacts for logs.
build
Process completed with exit code 1.
build
=========================================================== carbon-identity-framework BUILD SUCCESS ========================================================== Built version: 7.8.25-SNAPSHOT Results : Tests run: 0, Failures: 0, Errors: 0, Skipped: 0 [INFO] Results: [INFO] [INFO] Tests run: 38, Failures: 0, Errors: 0, Skipped: 0 [INFO] Results: [INFO] [INFO] Tests run: 341, Failures: 0, Errors: 0, Skipped: 0 [INFO] Results: [INFO] [INFO] Tests run: 48, Failures: 0, Errors: 0, Skipped: 0 [INFO] Results: [INFO] [INFO] Tests run: 0, Failures: 0, Errors: 0, Skipped: 0 [INFO] Results: [INFO] [INFO] Tests run: 27, Failures: 0, Errors: 0, Skipped: 0 [INFO] Results: [INFO] [INFO] Tests run: 85, Failures: 0, Errors: 0, Skipped: 0 [INFO] Results: [INFO] [INFO] Tests run: 44, Failures: 0, Errors: 0, Skipped: 0 [INFO] Results: [INFO] [INFO] Tests run: 45, Failures: 0, Errors: 0, Skipped: 0 [INFO] Results: [INFO] [INFO] Tests run: 123, Failures: 0, Errors: 0, Skipped: 0 [INFO] Results: [INFO] [INFO] Tests run: 63, Failures: 0, Errors: 0, Skipped: 0 [INFO] Results: [INFO] [INFO] Tests run: 14, Failures: 0, Errors: 0, Skipped: 0 [INFO] Results: [INFO] [INFO] Tests run: 16, Failures: 0, Errors: 0, Skipped: 0 [INFO] Results: [INFO] [INFO] Tests run: 1, Failures: 0, Errors: 0, Skipped: 0 [INFO] Results: [INFO] [INFO] Tests run: 166, Failures: 0, Errors: 0, Skipped: 0 [INFO] Results: [INFO] [INFO] Tests run: 417, Failures: 0, Errors: 0, Skipped: 0 [INFO] Results: [INFO] [INFO] Tests run: 18, Failures: 0, Errors: 0, Skipped: 0 [INFO] Results: [INFO] [INFO] Tests run: 22, Failures: 0, Errors: 0, Skipped: 0 [INFO] Results: [INFO] [INFO] Tests run: 95, Failures: 0, Errors: 0, Skipped: 0 [INFO] Results: [INFO] [INFO] Tests run: 40, Failures: 0, Errors: 0, Skipped: 0 [INFO] Results: [INFO] [INFO] Tests run: 259, Failures: 0, Errors: 0, Skipped: 0 [INFO] Results: [INFO] [INFO] Tests run: 38, Failures: 0, Errors: 0, Skipped: 0 [INFO] Results: [INFO] [INFO] Tests run: 0, Failures: 0, Errors: 0, Skipped: 0 [INFO] Results: [INFO] [INFO] Tests run: 35, Failures: 0, Errors: 0, Skipped: 0 [INFO] Results: [INFO] [INFO] Tests run: 19, Failures: 0, Errors: 0, Skipped: 0 [INFO] Results: [INFO] [INFO] Tests run: 113, Failures: 0, Errors: 0, Skipped: 0 [INFO] Results: [INFO] [INFO] Tests run: 422, Failures: 0, Errors: 0, Skipped: 0 [INFO] Results: [INFO] [INFO] Tests run: 50, Failures: 0, Errors: 0, Skipped: 0 [INFO] Results: [INFO] [INFO] Tests run: 11, Failures: 0, Errors: 0, Skipped: 0 [INFO] Results: [INFO] [INFO] Tests run: 59, Failures: 0, Errors: 0, Skipped: 0 [INFO] Results: [INFO] [INFO] Tests run: 0, Failures: 0, Errors: 0, Skipped: 0 [INFO] Results: [INFO] [INFO] Tests run: 0, Failures: 0, Errors: 0, Skipped: 0 [INFO] Results: [INFO] [INFO] Tests run: 40, Failures: 0, Errors: 0, Skipped: 0 [INFO] Results: [INFO] [INFO] Tests run: 78, Failures: 0, Errors: 0, Skipped: 0 [INFO] Results: [INFO] [INFO] Tests run: 21, Failures: 0, Errors: 0, Skipped: 0 [INFO] Results: [INFO] [INFO] Tests run: 1, Failures: 0, Errors: 0, Skipped: 0 [INFO] Results: [INFO] [INFO] Tests run: 0, Failures: 0, Errors: 0, Skipped: 0 [INFO] Results: [INFO] [INFO] Tests run: 0, Failures: 0, Errors: 0, Skipped: 0 [INFO] Results: [INFO] [INFO] Tests run: 0, Failures: 0, Errors: 0, Skipped: 0 [INFO] Results: [INFO] [INFO] Tests run: 1, Failures: 0, Errors: 0, Skipped: 0 [INFO] Results: [INFO] [INFO] Tests run: 63, Failures: 0, Errors: 0, Skipped: 0 [INFO] Results: [INFO] [INFO] Tests run: 4, Failures: 0, Errors: 0, Skipped: 0 [INFO] Results: [INFO] [INFO] Tests run: 69, Failures: 0, Errors: 0, Skipped: 0 [INFO] Results: [INFO] [INFO] Tests run: 27, Failures: 0, Errors: 0, Skipped: 0 [INFO] Results: [INFO] [INFO] Tests run: 1, Failures: 0, Errors: 0, Skipped: 0 [INFO] Results: [INFO] [INFO] Tests run: 10, Failures: 0, Errors: 0, Skipped: 0 [INFO] Results: [INFO] [INFO] Tests run: 4, Failures: 0
build
=========================================================== product-is BUILD FAILURE ========================================================== [INFO] Results: [INFO] [ERROR] Failures: [ERROR] org.wso2.identity.integration.test.application.mgt.ServiceProviderUserRoleValidationTestCase.testApplicationCountForUserWithoutFilter(org.wso2.identity.integration.test.application.mgt.ServiceProviderUserRoleValidationTestCase) [ERROR] Run 1: ServiceProviderUserRoleValidationTestCase.testApplicationCountForUserWithoutFilter:174 The expected application count without a filter does not match the actual application count: Expected Application Count: 11 Actual Application Count: 12. expected:<11> but was:<12> [INFO] Run 2: PASS [INFO] [ERROR] ApplicationNativeAuthentication2FATestCase.testInit:163->resetResidentIDPCache:584 » [ERROR] ApplicationNativeAuthenticationTestCase.testInit:139->resetResidentIDPCache:422 » [ERROR] org.wso2.identity.integration.test.auth.AdaptiveScriptTemporaryClaimPersistenceTestCase.testSendTemporaryClaimWithAuthenticationRequest(org.wso2.identity.integration.test.auth.AdaptiveScriptTemporaryClaimPersistenceTestCase) [ERROR] Run 1: AdaptiveScriptTemporaryClaimPersistenceTestCase.testSendTemporaryClaimWithAuthenticationRequest:168->AbstractAdaptiveAuthenticationTestCase.sendConsentGetRequest:300 » ClientProtocol [ERROR] Run 2: AdaptiveScriptTemporaryClaimPersistenceTestCase.testSendTemporaryClaimWithAuthenticationRequest:168->AbstractAdaptiveAuthenticationTestCase.sendConsentGetRequest:300 » ClientProtocol [INFO] [ERROR] org.wso2.identity.integration.test.auth.HttpMethodsTestCase.testHttpGetWithClientCredentialsAndComplexResponse(org.wso2.identity.integration.test.auth.HttpMethodsTestCase) [ERROR] Run 1: HttpMethodsTestCase.testHttpGetWithClientCredentialsAndComplexResponse:156->loginAndAssert:179 NullPointer [ERROR] Run 2: HttpMethodsTestCase.testHttpGetWithClientCredentialsAndComplexResponse:156->loginAndAssert:179 NullPointer [INFO] [ERROR] org.wso2.identity.integration.test.auth.HttpMethodsTestCase.testHttpPostWithApiKeyAndComplexPayloadAndResponse(org.wso2.identity.integration.test.auth.HttpMethodsTestCase) [ERROR] Run 1: HttpMethodsTestCase.testHttpPostWithApiKeyAndComplexPayloadAndResponse:163->loginAndAssert:179 NullPointer [ERROR] Run 2: HttpMethodsTestCase.testHttpPostWithApiKeyAndComplexPayloadAndResponse:163->loginAndAssert:179 NullPointer [INFO] [ERROR] org.wso2.identity.integration.test.auth.RiskBasedLoginTestCase.testInit(org.wso2.identity.integration.test.auth.RiskBasedLoginTestCase) [ERROR] Run 1: RiskBasedLoginTestCase.testInit:192->AbstractAdaptiveAuthenticationTestCase.updateResidentIDPProperty:287->AbstractAdaptiveAuthenticationTestCase.updateResidentIDP:275 » [ERROR] Run 2: RiskBasedLoginTestCase.testInit:192->AbstractAdaptiveAuthenticationTestCase.updateResidentIDPProperty:287->AbstractAdaptiveAuthenticationTestCase.updateResidentIDP:275 » [INFO] [ERROR] SelfSignUpConsentTest.atEnd:127 » UserAdminUserAdmin UserAdminUserAdminExcepti... [ERROR] org.wso2.identity.integration.test.consent.SelfSignUpConsentTest.resetResidentIDP(org.wso2.identity.integration.test.consent.SelfSignUpConsentTest) [ERROR] Run 1: SelfSignUpConsentTest.resetResidentIDP:133->updateResidentIDPProperty:288->updateResidentIDP:272 » [INFO] Run 2: PASS [INFO] Run 3: PASS [INFO] Run 4: PASS [INFO] Run 5: PASS [INFO] Run 6: PASS [INFO] Run 7: PASS [INFO] Run 8: PASS [INFO] Run 9: PASS [INFO] Run 10: PASS [INFO] [ERROR] SelfSignUpConsentTest.testPurposesWithoutConfiguredPurposes:207->updateResidentIDPProperty:288->updateResidentIDP:274 » [ERROR] org.wso2.identity.integration.test.idp.mgt.ChallengeQuestionsUITestCase.testRecovery(org.wso2.identity.integration.test.idp.mgt.ChallengeQuestionsUITestCase) [ERROR] Run 1: ChallengeQuestionsUITestCase.testRecovery:120->updateResidentIDPProperties:151->updateResidentIDP:166 » [ERROR] Run 2: ChallengeQuestionsUITestCase.testRecovery:120->updateResidentIDPProperties:151->updateResidentIDP:166 » [INFO] [ERROR] IdentityProvi

Artifacts

Produced during runtime
Name Size
product-is-mvn-build-log
679 KB
product-is-surefire-report
1.12 MB
repo-mvn-build-log
647 KB
repo-pr-diff
31.5 KB
repo-surefire-report
4.18 MB